Reaction Details
TargetCarbonic anhydrase 1
LigandBDBM50366097
Substrate/Competitorn/a
Meas. Tech.ChEMBL_808110 (CHEMBL1961261)
Ki 7570±n/a nM
Citation Carta, FMaresca, AScozzafava, ASupuran, CT Novel coumarins and 2-thioxo-coumarins as inhibitors of the tumor-associated carbonic anhydrases IX and XII. Bioorg Med Chem20:2266-73 (2012) 
 
Carbonic anhydrase 1
Name:Carbonic anhydrase 1
Type:Enzyme
Mol. Mass.:28873.37
Organism:Homo sapiens (Human)
Description:P00915
Residue:261
BDBM50366097
NameBDBM50366097
Synonyms:CHEMBL1957176
TypeSmall organic molecule
Emp. Form.C15H20O2SSi
Mol. Mass.292.469
SMILESCC(C)(C)[Si](C)(C)Oc1ccc2oc(=S)ccc2c1