Reaction Details
TargetCarbonic anhydrase 1
LigandBDBM50366109
Substrate/Competitorn/a
Meas. Tech.ChEMBL_808110 (CHEMBL1961261)
Ki 66300±n/a nM
Citation Carta, FMaresca, AScozzafava, ASupuran, CT Novel coumarins and 2-thioxo-coumarins as inhibitors of the tumor-associated carbonic anhydrases IX and XII. Bioorg Med Chem20:2266-73 (2012) 
 
Carbonic anhydrase 1
Name:Carbonic anhydrase 1
Type:Enzyme
Mol. Mass.:28873.37
Organism:Homo sapiens (Human)
Description:P00915
Residue:261
BDBM50366109
NameBDBM50366109
Synonyms:CHEMBL1957185
TypeSmall organic molecule
Emp. Form.C18H16O6S
Mol. Mass.360.381
SMILESCc1ccc(cc1)S(=O)(=O)OCCOc1ccc2ccc(=O)oc2c1