Reaction Details
TargetCarbonic anhydrase 9
LigandBDBM50366108
Substrate/Competitorn/a
Meas. Tech.ChEMBL_808112 (CHEMBL1961263)
Ki 920±n/a nM
Citation Carta, FMaresca, AScozzafava, ASupuran, CT Novel coumarins and 2-thioxo-coumarins as inhibitors of the tumor-associated carbonic anhydrases IX and XII. Bioorg Med Chem20:2266-73 (2012) 
 
Carbonic anhydrase 9
Name:Carbonic anhydrase 9
Type:Enzyme
Mol. Mass.:49669.03
Organism:Homo sapiens (Human)
Description:Catalytic domain of human cloned isozyme was used in the assay
Residue:459
BDBM50366108
NameBDBM50366108
Synonyms:CHEMBL1957184
TypeSmall organic molecule
Emp. Form.C11H10O4
Mol. Mass.206.1947
SMILESOCCOc1ccc2ccc(=O)oc2c1