Reaction Details
TargetCarbonic anhydrase 9
LigandBDBM50366110
Substrate/Competitorn/a
Meas. Tech.ChEMBL_808112 (CHEMBL1961263)
Ki 680±n/a nM
Citation Carta, FMaresca, AScozzafava, ASupuran, CT Novel coumarins and 2-thioxo-coumarins as inhibitors of the tumor-associated carbonic anhydrases IX and XII. Bioorg Med Chem20:2266-73 (2012) 
 
Carbonic anhydrase 9
Name:Carbonic anhydrase 9
Type:Enzyme
Mol. Mass.:49669.03
Organism:Homo sapiens (Human)
Description:Catalytic domain of human cloned isozyme was used in the assay
Residue:459
BDBM50366110
NameBDBM50366110
Synonyms:CHEMBL1957186
TypeSmall organic molecule
Emp. Form.C11H9FO3
Mol. Mass.208.1858
SMILESFCCOc1ccc2ccc(=O)oc2c1