Reaction Details
TargetCarbonic anhydrase 12
LigandBDBM50366107
Substrate/Competitorn/a
Meas. Tech.ChEMBL_808113 (CHEMBL1961264)
Ki 1270±n/a nM
Citation Carta, FMaresca, AScozzafava, ASupuran, CT Novel coumarins and 2-thioxo-coumarins as inhibitors of the tumor-associated carbonic anhydrases IX and XII. Bioorg Med Chem20:2266-73 (2012) 
 
Carbonic anhydrase 12
Name:Carbonic anhydrase 12
Type:Enzyme
Mol. Mass.:39456.00
Organism:Homo sapiens (Human)
Description:Catalytic domain of human cloned isozyme was used in the assay
Residue:354
BDBM50366107
NameBDBM50366107
Synonyms:CHEMBL1957183
TypeSmall organic molecule
Emp. Form.C12H10O2S
Mol. Mass.218.272
SMILESC=CCOc1cc(=S)oc2ccccc12