Reaction Details
TargetEphrin type-B receptor 4
LigandBDBM50366114
Substrate/Competitorn/a
Meas. Tech.ChEMBL_808130 (CHEMBL1961281)
IC50>35000±n/a nM
Citation Hundsdörfer, CHemmerling, HJGötz, CTotzke, FBednarski, PLe Borgne, MJose, J Indeno[1,2-b]indole derivatives as a novel class of potent human protein kinase CK2 inhibitors. Bioorg Med Chem20:2282-9 (2012) 
 
Ephrin type-B receptor 4
Name:Ephrin type-B receptor 4
Type:Enzyme
Mol. Mass.:108273.51
Organism:Homo sapiens (Human)
Description:P54760
Residue:987
BDBM50366114
NameBDBM50366114
Synonyms:CHEMBL1957190
TypeSmall organic molecule
Emp. Form.C18H17NO2
Mol. Mass.279.3331
SMILESCC(C)n1c2CCCC(=O)c2c2C(=O)c3ccccc3-c12