Reaction Details
TargetFocal adhesion kinase 1
LigandBDBM50366114
Substrate/Competitorn/a
Meas. Tech.ChEMBL_808132 (CHEMBL1961283)
IC50>35000±n/a nM
Citation Hundsdörfer, CHemmerling, HJGötz, CTotzke, FBednarski, PLe Borgne, MJose, J Indeno[1,2-b]indole derivatives as a novel class of potent human protein kinase CK2 inhibitors. Bioorg Med Chem20:2282-9 (2012) 
 
Focal adhesion kinase 1
Name:Focal adhesion kinase 1
Type:Tyrosine-protein kinase
Mol. Mass.:119233.17
Organism:Homo sapiens (Human)
Description:Q05397
Residue:1052
BDBM50366114
NameBDBM50366114
Synonyms:CHEMBL1957190
TypeSmall organic molecule
Emp. Form.C18H17NO2
Mol. Mass.279.3331
SMILESCC(C)n1c2CCCC(=O)c2c2C(=O)c3ccccc3-c12