Reaction Details
TargetAromatase
LigandBDBM50366133
Substrate/Competitorn/a
Meas. Tech.ChEMBL_808290 (CHEMBL1961307)
IC50 1360±n/a nM
Citation Mayhoub, ASMarler, LKondratyuk, TPPark, EJPezzuto, JMCushman, M Optimization of the aromatase inhibitory activities of pyridylthiazole analogues of resveratrol. Bioorg Med Chem20:2427-34 (2012) 
 
Aromatase
Name:Aromatase
Type:Enzyme
Mol. Mass.:57888.92
Organism:Homo sapiens (Human)
Description:P11511
Residue:503
BDBM50366133
NameBDBM50366133
Synonyms:CHEMBL1957222
TypeSmall organic molecule
Emp. Form.C15H13N3OS
Mol. Mass.283.348
SMILESCCOc1ccc(cn1)-c1csc(n1)-c1ccncc1