Reaction Details
TargetAromatase
LigandBDBM50366124
Substrate/Competitorn/a
Meas. Tech.ChEMBL_808290 (CHEMBL1961307)
IC50 18000±n/a nM
Citation Mayhoub, ASMarler, LKondratyuk, TPPark, EJPezzuto, JMCushman, M Optimization of the aromatase inhibitory activities of pyridylthiazole analogues of resveratrol. Bioorg Med Chem20:2427-34 (2012) 
 
Aromatase
Name:Aromatase
Type:Enzyme
Mol. Mass.:57888.92
Organism:Homo sapiens (Human)
Description:P11511
Residue:503
BDBM50366124
NameBDBM50366124
Synonyms:CHEMBL1957213
TypeSmall organic molecule
Emp. Form.C15H12N2OS
Mol. Mass.268.334
SMILESCOc1ccc(cc1)-c1nc(cs1)-c1cccnc1