Reaction Details
TargetAromatase
LigandBDBM50366128
Substrate/Competitorn/a
Meas. Tech.ChEMBL_808290 (CHEMBL1961307)
IC50 23±n/a nM
Citation Mayhoub, ASMarler, LKondratyuk, TPPark, EJPezzuto, JMCushman, M Optimization of the aromatase inhibitory activities of pyridylthiazole analogues of resveratrol. Bioorg Med Chem20:2427-34 (2012) 
 
Aromatase
Name:Aromatase
Type:Enzyme
Mol. Mass.:57888.92
Organism:Homo sapiens (Human)
Description:P11511
Residue:503
BDBM50366128
NameBDBM50366128
Synonyms:CHEMBL1957217
TypeSmall organic molecule
Emp. Form.C14H11N3OS
Mol. Mass.269.322
SMILESCOc1cc(ccn1)-c1nc(cs1)-c1cccnc1