Reaction Details
TargetAromatase
LigandBDBM50366118
Substrate/Competitorn/a
Meas. Tech.ChEMBL_808291 (CHEMBL1961308)
Ki 1160±n/a nM
Citation Mayhoub, ASMarler, LKondratyuk, TPPark, EJPezzuto, JMCushman, M Optimization of the aromatase inhibitory activities of pyridylthiazole analogues of resveratrol. Bioorg Med Chem20:2427-34 (2012) 
 
Aromatase
Name:Aromatase
Type:Enzyme
Mol. Mass.:57888.92
Organism:Homo sapiens (Human)
Description:P11511
Residue:503
BDBM50366118
NameBDBM50366118
Synonyms:CHEMBL1957208
TypeSmall organic molecule
Emp. Form.C13H8BrN3S
Mol. Mass.318.192
SMILESBrc1cccc(c1)-c1nc(ns1)-c1cccnc1