Reaction Details
TargetAromatase
LigandBDBM50366120
Substrate/Competitorn/a
Meas. Tech.ChEMBL_808291 (CHEMBL1961308)
Ki 63±n/a nM
Citation Mayhoub, ASMarler, LKondratyuk, TPPark, EJPezzuto, JMCushman, M Optimization of the aromatase inhibitory activities of pyridylthiazole analogues of resveratrol. Bioorg Med Chem20:2427-34 (2012) 
 
Aromatase
Name:Aromatase
Type:Enzyme
Mol. Mass.:57888.92
Organism:Homo sapiens (Human)
Description:P11511
Residue:503
BDBM50366120
NameBDBM50366120
Synonyms:CHEMBL1601919
TypeSmall organic molecule
Emp. Form.C14H10N2S
Mol. Mass.238.308
SMILESc1sc(nc1-c1cccnc1)-c1ccccc1