Reaction Details
TargetAromatase
LigandBDBM50366121
Substrate/Competitorn/a
Meas. Tech.ChEMBL_808291 (CHEMBL1961308)
Ki 12560±n/a nM
Citation Mayhoub, ASMarler, LKondratyuk, TPPark, EJPezzuto, JMCushman, M Optimization of the aromatase inhibitory activities of pyridylthiazole analogues of resveratrol. Bioorg Med Chem20:2427-34 (2012) 
 
Aromatase
Name:Aromatase
Type:Enzyme
Mol. Mass.:57888.92
Organism:Homo sapiens (Human)
Description:P11511
Residue:503
BDBM50366121
NameBDBM50366121
Synonyms:CHEMBL1957210
TypeSmall organic molecule
Emp. Form.C14H9FN2S
Mol. Mass.256.298
SMILESFc1ccc(cc1)-c1nc(cs1)-c1cccnc1