Reaction Details
TargetNitric oxide synthase, inducible
LigandBDBM23926
Substrate/Competitorn/a
Meas. Tech.ChEMBL_808301 (CHEMBL1961318)
IC50 23200±n/a nM
Citation Mayhoub, ASMarler, LKondratyuk, TPPark, EJPezzuto, JMCushman, M Optimization of the aromatase inhibitory activities of pyridylthiazole analogues of resveratrol. Bioorg Med Chem20:2427-34 (2012) 
 
Nitric oxide synthase, inducible
Name:Nitric oxide synthase, inducible
Type:Enzyme
Mol. Mass.:130595.79
Organism:Mus musculus (mouse)
Description:Recombinant enzyme overexpressed in E. coli.
Residue:1144
BDBM23926
NameBDBM23926
Synonyms:(E)-resveratrol CHEMBL165 Stilbene, 2f cid_445154 trans-resveratrol
TypeSmall organic molecule
Emp. Form.C14H12O3
Mol. Mass.228.2433
SMILESOc1ccc(\C=C\c2cc(O)cc(O)c2)cc1