Reaction Details
TargetcAMP-specific 3',5'-cyclic phosphodiesterase 4B
LigandBDBM50366135
Substrate/Competitorn/a
Meas. Tech.ChEMBL_808311 (CHEMBL1961328)
EC50 890±n/a nM
Citation Kumar, KSKiran Kumar, SYogi Sreenivas, BGorja, DRKapavarapu, RRambabu, DRama Krishna, GReddy, CMBasaveswara Rao, MVParsa, KVPal, M C-C bond formation at C-2 of a quinoline ring: synthesis of 2-(1H-indol-3-yl)quinoline-3-carbonitrile derivatives as a new class of PDE4 inhibitors. Bioorg Med Chem20:2199-207 (2012) 
 
cAMP-specific 3',5'-cyclic phosphodiesterase 4B
Name:cAMP-specific 3',5'-cyclic phosphodiesterase 4B
Type:Protein
Mol. Mass.:83318.87
Organism:Homo sapiens (Human)
Description:Q07343
Residue:736
BDBM50366135
NameBDBM50366135
Synonyms:CHEMBL1957302
TypeSmall organic molecule
Emp. Form.C19H13N3O
Mol. Mass.299.326
SMILESCOc1ccc2c(c[nH]c2c1)-c1nc2ccccc2cc1C#N