Reaction Details
TargetProstaglandin E2 receptor EP4 subtype
LigandBDBM50366138
Substrate/Competitorn/a
Meas. Tech.ChEMBL_808316 (CHEMBL1961333)
Ki 0.012±n/a nM
Citation Kambe, TMaruyama, TNakai, YYoshida, HOida, HMaruyama, TAbe, NNishiura, ANakai, HToda, M Discovery of novel prostaglandin analogs as potent and selective EP2/EP4 dual agonists. Bioorg Med Chem20:2235-51 (2012) 
 
Prostaglandin E2 receptor EP4 subtype
Name:Prostaglandin E2 receptor EP4 subtype
Type:G-protein coupled receptor
Mol. Mass.:56175.66
Organism:Mus musculus (Mouse)
Description:n/a
Residue:513
BDBM50366138
NameBDBM50366138
Synonyms:CHEMBL1957437
TypeSmall organic molecule
Emp. Form.C30H28N2O4S2
Mol. Mass.544.684
SMILESO[C@@H](Cc1cccc(c1)-c1ccc2ccccc2c1)\C=C\[C@H]1CCC(=O)N1CCSc1nc(cs1)C(O)=O