Reaction Details
TargetP2Y purinoceptor 2
LigandBDBM50366146
Substrate/Competitorn/a
Meas. Tech.ChEMBL_805630 (CHEMBL1960464)
EC50 4000±n/a nM
Citation Van Poecke, SBarrett, MOSanthosh Kumar, TSinnaeve, DMartins, JCJacobson, KAKendall Harden, TVan Calenbergh, S Synthesis and P2Y2 receptor agonist activities of uridine 5'-phosphonate analogues. Bioorg Med Chem20:2304-15 (2012) 
 
P2Y purinoceptor 2
Name:P2Y purinoceptor 2
Type:PROTEIN
Mol. Mass.:42299.21
Organism:Homo sapiens (Human)
Description:ChEMBL_1455361
Residue:377
BDBM50366146
NameBDBM50366146
Synonyms:CHEMBL1957448
TypeSmall organic molecule
Emp. Form.C12H15N2O7P
Mol. Mass.330.2316
SMILESO[C@@H]1[C@H](O)[C@]2(CCP([O-])([O-])=O)C[C@@H]2[C@H]1n1ccc(=O)[nH]c1=O