Reaction Details
TargetP2Y purinoceptor 2
LigandBDBM50366149
Substrate/Competitorn/a
Meas. Tech.ChEMBL_805630 (CHEMBL1960464)
EC50>20000±n/a nM
Citation Van Poecke, SBarrett, MOSanthosh Kumar, TSinnaeve, DMartins, JCJacobson, KAKendall Harden, TVan Calenbergh, S Synthesis and P2Y2 receptor agonist activities of uridine 5'-phosphonate analogues. Bioorg Med Chem20:2304-15 (2012) 
 
P2Y purinoceptor 2
Name:P2Y purinoceptor 2
Type:PROTEIN
Mol. Mass.:42299.21
Organism:Homo sapiens (Human)
Description:ChEMBL_1455361
Residue:377
BDBM50366149
NameBDBM50366149
Synonyms:CHEMBL1957445
TypeSmall organic molecule
Emp. Form.C18H19N2O8PS
Mol. Mass.454.391
SMILESO[C@@H]1[C@@H](CCP(O)(O)=O)O[C@H]([C@@H]1O)n1cc(-c2cc3ccccc3s2)c(=O)[nH]c1=O