Reaction Details
TargetP2Y purinoceptor 2
LigandBDBM50258427
Substrate/Competitorn/a
Meas. Tech.ChEMBL_805630 (CHEMBL1960464)
EC50 5100±n/a nM
Citation Van Poecke, SBarrett, MOSanthosh Kumar, TSinnaeve, DMartins, JCJacobson, KAKendall Harden, TVan Calenbergh, S Synthesis and P2Y2 receptor agonist activities of uridine 5'-phosphonate analogues. Bioorg Med Chem20:2304-15 (2012) 
 
P2Y purinoceptor 2
Name:P2Y purinoceptor 2
Type:PROTEIN
Mol. Mass.:42299.21
Organism:Homo sapiens (Human)
Description:ChEMBL_1455361
Residue:377
BDBM50258427
NameBDBM50258427
Synonyms:CHEMBL522015 | uridine5'-methylene-phosphonate
TypeSmall organic molecule
Emp. Form.C10H15N2O8P
Mol. Mass.322.2085
SMILESO[C@@H]1[C@@H](CCP(O)(O)=O)O[C@H]([C@@H]1O)n1ccc(=O)[nH]c1=O