Reaction Details
TargetAndrogen receptor
LigandBDBM50366216
Substrate/Competitorn/a
Meas. Tech.ChEMBL_805648 (CHEMBL1960482)
IC50 16±n/a nM
Citation Yamamoto, STomita, NSuzuki, YSuzaki, TKaku, THara, TYamaoka, MKanzaki, NHasuoka, ABaba, AIto, M Design, synthesis, and biological evaluation of 4-arylmethyl-1-phenylpyrazole and 4-aryloxy-1-phenylpyrazole derivatives as novel androgen receptor antagonists. Bioorg Med Chem20:2338-52 (2012) 
 
Androgen receptor
Name:Androgen receptor
Type:Receptor
Mol. Mass.:99185.27
Organism:Homo sapiens (Human)
Description:CHO cells were stably transfected with human AR gene.
Residue:920
BDBM50366216
NameBDBM50366216
Synonyms:CHEMBL1957621
TypeSmall organic molecule
Emp. Form.C20H17ClN4O
Mol. Mass.364.828
SMILESCc1nn(c(C)c1Cc1ccc(cc1)C(N)=O)-c1ccc(C#N)c(Cl)c1