Reaction Details
TargetSphingosine 1-phosphate receptor 3
LigandBDBM23165
Substrate/Competitorn/a
Meas. Tech.ChEMBL_806030 (CHEMBL1960547)
EC50 3.3±n/a nM
Citation Nakamura, TAsano, MSekiguchi, YMizuno, YTamaki, KNara, FKawase, YYabe, YNakai, DKamiyama, EUrasaki-Kaneno, YShimozato, TDoi-Komuro, HKagari, TTomisato, WInoue, RNagasaki, MYuita, HOguchi-Oshima, KKaneko, RNishi, T Synthesis and evaluation of CS-2100, a potent, orally active and S1P(3)- sparing S1P(1) agonist. Eur J Med Chem51:92-8 (2012) 
 
Sphingosine 1-phosphate receptor 3
Name:Sphingosine 1-phosphate receptor 3
Type:G Protein-Coupled Receptor (GPCR)
Mol. Mass.:42278.13
Organism:Homo sapiens (Human)
Description:Q99500
Residue:378
BDBM23165
NameBDBM23165
Synonyms:CHEMBL366208 [(2S)-2-amino-3-hydroxy-2-[2-(4-octylphenyl)ethyl]propoxy]phosphonic acid
TypeSmall organic molecule
Emp. Form.C19H34NO5P
Mol. Mass.387.4507
SMILESCCCCCCCCc1ccc(CC[C@](N)(CO)COP(O)(O)=O)cc1