Reaction Details
TargetAlpha-1A/Alpha-1B/Alpha-1D adrenergic receptor
LigandBDBM50137978
Substrate/Competitorn/a
Meas. Tech.ChEMBL_32418 (CHEMBL644957)
Ki 0.820000±n/a nM
Citation Campiani, GButini, SFattorusso, CCatalanotti, BGemma, SNacci, VMorelli, ECagnotto, AMereghetti, IMennini, TCarli, MMinetti, PDi Cesare, MAMastroianni, DScafetta, NGalletti, BStasi, MACastorina, MPacifici, LVertechy, MDi Serio, SGhirardi, OTinti, OCarminati, P Pyrrolo[1,3]benzothiazepine-based serotonin and dopamine receptor antagonists. Molecular modeling, further structure-activity relationship studies, and identification of novel atypical antipsychotic agents. J Med Chem47:143-57 (2003) 
 
Alpha-1A/Alpha-1B/Alpha-1D adrenergic receptor
Name:Alpha-1A/Alpha-1B/Alpha-1D adrenergic receptor
Type:n/a
Mol. Mass.:n/a
Description:ASSAY_ID of EBI is 303470
Components:This complex has 3 components.
Component 1
Name:Alpha-1B adrenergic receptor
Synonyms:ADA1B_RAT Alpha 1B-adrenoceptor Alpha adrenergic receptor 1A and 1B Alpha-1Adrenoceptor Alpha-1B adrenoreceptor | adrenergic Alpha1B
Type:G Protein-Coupled Receptor (GPCR)
Mol. Mass.:56606.71
Organism:Rattus norvegicus (rat)
Description:Receptor binding assays were performed using rat cortical membranes.
Residue:515
Component 2
Name:Alpha-1A adrenergic receptor
Synonyms:ADA1A_RAT Adra1c Alpha-1A adrenoceptor Alpha-1C adrenergic receptor | adrenergic Alpha1A
Type:Protein
Mol. Mass.:51620.15
Organism:Rattus norvegicus (Rat)
Description:P43140
Residue:466
Component 3
Name:Alpha-1D adrenergic receptor
Synonyms:ADA1D_RAT Adra1d Alpha-1D adrenergic receptor | Serotonin 1a (5-HT1a) receptor/Adrenergic receptor alpha-1
Type:Protein
Mol. Mass.:59375.97
Organism:Rattus norvegicus (Rat)
Description:P23944
Residue:561
BDBM50137978
NameBDBM50137978
Synonyms:(S)-7-Chloro-9-(4-methyl-piperazin-1-yl)-9,10-dihydro-4-thia-10a-aza-benzo[f]azulene | CHEMBL368324
TypeSmall organic molecule
Emp. Form.C17H20ClN3S
Mol. Mass.333.879
SMILESCN1CCN(CC1)[C@@H]1Cn2cccc2Sc2ccc(Cl)cc12