Reaction Details
Target5-hydroxytryptamine receptor 2A
LigandBDBM50137980
Substrate/Competitorn/a
Meas. Tech.ChEBML_2670
Ki 1.1±n/a nM
Citation Campiani, GButini, SFattorusso, CCatalanotti, BGemma, SNacci, VMorelli, ECagnotto, AMereghetti, IMennini, TCarli, MMinetti, PDi Cesare, MAMastroianni, DScafetta, NGalletti, BStasi, MACastorina, MPacifici, LVertechy, MDi Serio, SGhirardi, OTinti, OCarminati, P Pyrrolo[1,3]benzothiazepine-based serotonin and dopamine receptor antagonists. Molecular modeling, further structure-activity relationship studies, and identification of novel atypical antipsychotic agents. J Med Chem47:143-57 (2003) 
 
5-hydroxytryptamine receptor 2A
Name:5-hydroxytryptamine receptor 2A
Type:G Protein-Coupled Receptor (GPCR)
Mol. Mass.:52852.05
Organism:Rattus norvegicus (rat)
Description:Rat cortex membranes 5-HT2A receptors.
Residue:471
BDBM50137980
NameBDBM50137980
Synonyms:1-Methyl-9-(4-methyl-piperazin-1-yl)-4-thia-10a-aza-benzo[f]azulene | CHEMBL176169
TypeSmall organic molecule
Emp. Form.C18H21N3S
Mol. Mass.311.444
SMILESCN1CCN(CC1)C1=Cn2c(C)ccc2Sc2ccccc12