Reaction Details
TargetD(3) dopamine receptor
LigandBDBM50137982
Substrate/Competitorn/a
Meas. Tech.ChEBML_62769
Ki 4.3±n/a nM
Citation Campiani, GButini, SFattorusso, CCatalanotti, BGemma, SNacci, VMorelli, ECagnotto, AMereghetti, IMennini, TCarli, MMinetti, PDi Cesare, MAMastroianni, DScafetta, NGalletti, BStasi, MACastorina, MPacifici, LVertechy, MDi Serio, SGhirardi, OTinti, OCarminati, P Pyrrolo[1,3]benzothiazepine-based serotonin and dopamine receptor antagonists. Molecular modeling, further structure-activity relationship studies, and identification of novel atypical antipsychotic agents. J Med Chem47:143-57 (2003) 
 
D(3) dopamine receptor
Name:D(3) dopamine receptor
Type:Protein
Mol. Mass.:49540.58
Organism:Rattus norvegicus (Rat)
Description:P19020
Residue:446
BDBM50137982
NameBDBM50137982
Synonyms:7-Chloro-9-(4-methyl-[1,4]diazepan-1-yl)-4-thia-10a-aza-benzo[f]azulene | CHEMBL177455
TypeSmall organic molecule
Emp. Form.C18H20ClN3S
Mol. Mass.345.89
SMILESCN1CCCN(CC1)C1=Cn2cccc2Sc2ccc(Cl)cc12