Reaction Details
TargetEndothelin-1 receptor
LigandBDBM50000558
Substrate/Competitorn/a
Meas. Tech.ChEBML_63367
Kd 0.150000±n/a nM
Citation Hunt, JTLee, VGStein, PDHedberg, ALiu, ECMcMullen, DMoreland, S Structure-activity relationships of monocyclic endothelin analogs Bioorg Med Chem Lett1:33-38 (1991)    Article
 
Endothelin-1 receptor
Name:Endothelin-1 receptor
Type:Enzyme Catalytic Domain
Mol. Mass.:48256.91
Organism:RAT
Description:ENDOTHELIN A EDNRA RAT::P26684
Residue:426
BDBM50000558
NameBDBM50000558
Synonyms:CHEMBL437472 Endothelin -1 Endothelin derivative c(Cys-Ser-c(Cys-Ser-Ser-Leu-Met-Asp-Lys-Gln-Cys)-Val-Tyr-Phe-Cys)-His-Leu-Asp-Ile-Ile-Trp
TypeSmall organic molecule
Emp. Form.C109H159N25O32S5
Mol. Mass.2491.902
SMILESCC[C@H](C)[C@H](NC(=O)[C@H](CC(O)=O)NC(=O)[C@H](CC(C)C)NC(=O)[C@H](Cc1cnc[nH]1)NC(=O)[C@@H]1CSSC[C@@H](N)C(=O)N[C@H](CO)C(=O)N[C@H]2CSSC[C@@H](NC(=O)[C@H](CCC(O)=O)NC(=O)[C@H](CCCCN)NC(=O)[C@@H](CC(O)=O)NC(=O)[C@H](CCSC)NC(=O)[C@@H](CC(C)C)NC(=O)[C@H](CO)NC(=O)[C@@H](CO)NC2=O)C(=O)N[C@@H](C(C)C)C(=O)N[C@H](Cc2ccc(O)cc2)C(=O)N[C@@H](Cc2ccccc2)C(=O)N1)C(=O)N[C@@H]([C@@H](C)CC)C(=O)N[C@@H](Cc1c[nH]c2ccccc12)C(O)=O