Reaction Details
TargetGag-Pol polyprotein [489-587]
LigandBDBM50279829
Substrate/Competitorn/a
Meas. Tech.ChEMBL_79972 (CHEMBL690410)
Ki 52000±n/a nM
Citation McLeod, DABrinkworth, RIAshley, JAJanda, KDWirsching, P Phosphonamidates and phosphonamidate esters as HIV-1 protease inhibitors Bioorg Med Chem Lett1:653-658 (1991)    Article
 
Gag-Pol polyprotein [489-587]
Name:Gag-Pol polyprotein [489-587]
Type:Enzyme Subunit
Mol. Mass.:10781.16
Organism:Human immunodeficiency virus type 1
Description:P04585[489-587]
Residue:99
BDBM50279829
NameBDBM50279829
Synonyms:((S)-2-Carbamoyl-pyrrolidin-1-yl)-[2-phenyl-1-(2,2,2-trifluoro-acetylamino)-ethyl]-phosphinic acid anion
TypeSmall organic molecule
Emp. Form.C15H18F3N3O4P
Mol. Mass.392.2906
SMILESNC(=O)[C@@H]1CCCN1P([O-])(=O)C(Cc1ccccc1)NC(=O)C(F)(F)F