Reaction Details
TargetPlatelet-activating factor receptor
LigandBDBM50366241
Substrate/Competitorn/a
Meas. Tech.ChEMBL_155156 (CHEMBL760196)
Ki 103±n/a nM
Citation Sahoo, SPGraham, DWActon, JBiftu, TBugianesi, RLGirotra, NNKuo, CPonpipom, MMDoebber, TWWu, MSHwang, SLam, MMacIntyre, DBach, TJLuell, SMeurer, RDavies, PAlberts, AWChabala, JC Synthesis and biological activity of MK 287 (L-680,573): a potent, specific and orally active paf receptor antagonist Bioorg Med Chem Lett1:327-332 (1991)    Article
 
Platelet-activating factor receptor
Name:Platelet-activating factor receptor
Type:Protein
Mol. Mass.:39005.63
Organism:Cavia porcellus
Description:n/a
Residue:342
BDBM50366241
NameBDBM50366241
Synonyms:CHEMBL297624 | L-652731
TypeSmall organic molecule
Emp. Form.C22H28O7
Mol. Mass.404.4535
SMILESCOc1cc(cc(OC)c1OC)[C@H]1CC[C@@H](O1)c1cc(OC)c(OC)c(OC)c1