Reaction Details
TargetAdenosine receptor A1
LigandBDBM82031
Substrate/Competitorn/a
Meas. Tech.ChEBML_28981
Ki 94±n/a nM
Citation Nair, VFesbender, AJMiller, LPBruce, JL High selectivity of novel isoguanosine analogues for the adenosine A1 receptor Bioorg Med Chem Lett1:481-486 (1991)    Article
 
Adenosine receptor A1
Name:Adenosine receptor A1
Type:Protein
Mol. Mass.:36704.13
Organism:Rattus norvegicus (rat)
Description:n/a
Residue:326
BDBM82031
NameBDBM82031
Synonyms:2-Oxoado (isoguanosine) isoguanosine
TypeSmall organic molecule
Emp. Form.C10H13N5O5
Mol. Mass.283.2407
SMILESNc1[nH]c(=O)nc2n(cnc12)[C@@H]1O[C@H](CO)[C@@H](O)[C@H]1O