Reaction Details
TargetAdenosine receptor A1
LigandBDBM50366245
Substrate/Competitorn/a
Meas. Tech.ChEBML_28981
Ki 20±n/a nM
Citation Nair, VFesbender, AJMiller, LPBruce, JL High selectivity of novel isoguanosine analogues for the adenosine A1 receptor Bioorg Med Chem Lett1:481-486 (1991)    Article
 
Adenosine receptor A1
Name:Adenosine receptor A1
Type:Protein
Mol. Mass.:36704.13
Organism:Rattus norvegicus (rat)
Description:n/a
Residue:326
BDBM50366245
NameBDBM50366245
Synonyms:CHEMBL607881
TypeSmall organic molecule
Emp. Form.C15H20IN5O4
Mol. Mass.461.2549
SMILESOC[C@H]1OC([C@H](O)[C@@H]1O)n1cnc2c(NC3CCCC3)nc(I)nc12