Reaction Details
TargetAdenosine receptor A1
LigandBDBM50366244
Substrate/Competitorn/a
Meas. Tech.ChEBML_28981
Ki 55±n/a nM
Citation Nair, VFesbender, AJMiller, LPBruce, JL High selectivity of novel isoguanosine analogues for the adenosine A1 receptor Bioorg Med Chem Lett1:481-486 (1991)    Article
 
Adenosine receptor A1
Name:Adenosine receptor A1
Type:Protein
Mol. Mass.:36704.13
Organism:Rattus norvegicus (rat)
Description:n/a
Residue:326
BDBM50366244
NameBDBM50366244
Synonyms:CHEMBL608445
TypeSmall organic molecule
Emp. Form.C14H19N5O5
Mol. Mass.337.3312
SMILESOC[C@H]1OC([C@H](O)[C@@H]1O)n1cnc2c(NC3CCC3)[nH]c(=O)nc12