Reaction Details
TargetCholecystokinin receptor type A
LigandBDBM50295557
Substrate/Competitorn/a
Meas. Tech.ChEBML_40042
IC50>80000±n/a nM
Citation Kendrick, DARyder, HSemple, GSzelke, M Cholecystokinin analogues: The ergopeptine alkaloids as models of the active conformation of CCK Bioorg Med Chem Lett2:9-12 (1992)    Article
 
Cholecystokinin receptor type A
Name:Cholecystokinin receptor type A
Type:PROTEIN
Mol. Mass.:48454.29
Organism:Mus musculus
Description:ChEMBL_40042
Residue:436
BDBM50295557
NameBDBM50295557
Synonyms:7-Methyl-4,6,6a,7,8,9,10,10a-octahydro-indolo[4,3-fg]quinoline-9-carboxylic acid ((2R,5S,10bS)-5-benzyl-10b-hydroxy-2-methyl-3,6-dioxo-octahydro-oxazolo[3,2-a]pyrrolo[2,1-c]pyrazin-2-yl)-amide CHEMBL1732 Dihydroer-gotamin
TypeSmall organic molecule
Emp. Form.C33H37N5O5
Mol. Mass.583.6774
SMILESCN1C[C@@H](C[C@H]2[C@H]1Cc1c[nH]c3cccc2c13)C(=O)N[C@]1(C)O[C@@]2(O)[C@@H]3CCCN3C(=O)[C@H](Cc3ccccc3)N2C1=O