Reaction Details
Target5-hydroxytryptamine receptor 3A
LigandBDBM50155152
Substrate/Competitorn/a
Meas. Tech.ChEBML_3404
Ki 336±n/a nM
Citation Flynn, DLBecker, DPSpangler, DPNosal, RGullikson, GWMoummi, CYang, D New aza(nor)adamantanes are agonists at the newly identified serotonin 5-HT4 receptor and antagonists at the 5-HT3 receptor Bioorg Med Chem Lett2:1613-1618 (1992)    Article
 
5-hydroxytryptamine receptor 3A
Name:5-hydroxytryptamine receptor 3A
Type:Enzyme Catalytic Domain
Mol. Mass.:55428.70
Organism:RAT
Description:5-HT3 HTR3A RAT::P35563
Residue:483
BDBM50155152
NameBDBM50155152
Synonyms:4-Amino-N-(1-aza-tricyclo[3.3.1.1*3,7*]dec-4-yl)-5-chloro-2-methoxy-benzamide CHEMBL295155 | SC-51718
TypeSmall organic molecule
Emp. Form.C17H22ClN3O2
Mol. Mass.335.828
SMILESCOc1cc(N)c(Cl)cc1C(=O)NC1C2CC3CC1CN(C3)C2