Reaction Details
TargetPlatelet-activating factor receptor
LigandBDBM81972
Substrate/Competitorn/a
Meas. Tech.ChEMBL_155143 (CHEMBL760184)
Ki 14.3±n/a nM
Citation Bugianesi, RLPonpipom, MMParsons, WHHwang, SDoebber, TWLam, MWu, MSAlberts, AWChabala, JC Synthesis and biological activity of the platelet-activating factor antagonist ()-trans-2-(3-methoxy-4-phenylsulfonylethoxy-5-n-propylsulfonylphenyl)-5-(3,4,5-trimethoxyphenyl)tetrahydrofuran (L-671,284) and its analogs Bioorg Med Chem Lett2:181-184 (1992)    Article
 
Platelet-activating factor receptor
Name:Platelet-activating factor receptor
Type:Enzyme Catalytic Domain
Mol. Mass.:39219.60
Organism:Homo sapiens (Human)
Description:PAF Platelet activating factor PTAFR HUMAN::P25105
Residue:342
BDBM81972
NameBDBM81972
Synonyms:(S)-(+)-ALPHA-METHYL-1H-IMIDAZOLE-4-ETHANAMINE DIHYDROBROMIDE CAS_75614-93-6
TypeSmall organic molecule
Emp. Form.C6H11N3
Mol. Mass.125.1716
SMILESC[C@H](N)Cc1cnc[nH]1