Reaction Details
TargetNADH-ubiquinone oxidoreductase chain 4
LigandBDBM50135527
Substrate/Competitorn/a
Meas. Tech.ChEBML_141731
IC50 3.5±n/a nM
Citation Josephs, JLCasida, JE Novel synthetic rotenoids with blocked B/C ring systems Bioorg Med Chem Lett2:593-596 (1992)    Article
 
NADH-ubiquinone oxidoreductase chain 4
Name:NADH-ubiquinone oxidoreductase chain 4
Type:PROTEIN
Mol. Mass.:51594.97
Organism:Homo sapiens (Human)
Description:ChEMBL_141731
Residue:459
BDBM50135527
NameBDBM50135527
Synonyms:(-)-cis-rotenone (2R,6aS,12aS)-8,9-dimethoxy-2-(prop-1-en-2-yl)-1,2,12,12a-tetrahydrochromeno[3,4-b]furo[2,3-h]chromen-6(6aH)-one Barbasco Canex [2R-(2alpha,6aalpha,12aalpha)]-1,2,12,12a-tetrahydro-8,9-dimethoxy-2-(1-methylethenyl)[1]benzopyrano[3,4-b]furo[2,3-H][1]benzopyran-6(6aH)-one | rotenone
TypeSmall organic molecule
Emp. Form.C23H22O6
Mol. Mass.394.4172
SMILESCOc1cc2OC[C@H]3Oc4c5C[C@@H](Oc5ccc4C(=O)[C@H]3c2cc1OC)C(C)=C