Reaction Details
TargetPlatelet-activating factor receptor
LigandBDBM50000714
Substrate/Competitorn/a
Meas. Tech.ChEBML_155000
IC50 50±n/a nM
Citation Hodgkin, EEMiller, AWhittaker, M A partial pharmacophore for the platelet activating factor (PAF) receptor Bioorg Med Chem Lett2:597-602 (1992)    Article
 
Platelet-activating factor receptor
Name:Platelet-activating factor receptor
Type:Enzyme Catalytic Domain
Mol. Mass.:39219.60
Organism:Homo sapiens (Human)
Description:PAF Platelet activating factor PTAFR HUMAN::P25105
Residue:342
BDBM50000714
NameBDBM50000714
Synonyms:3-[4-(2-Chloro-phenyl)-9-methyl-6H-1-thia-5,7,8,9a-tetraaza-cyclopenta[e]azulen-2-yl]-1-morpholin-4-yl-propan-1-one 3-[4-(2-Chloro-phenyl)-9-methyl-6H-1-thia-5,7,8,9a-tetraaza-cyclopenta[e]azulen-2-yl]-1-morpholin-4-yl-propan-1-one(WEB2086) CHEMBL280164 | WEB2086
TypeSmall organic molecule
Emp. Form.C22H22ClN5O2S
Mol. Mass.455.96
SMILESCc1nnc2CN=C(c3cc(CCC(=O)N4CCOCC4)sc3-n12)c1ccccc1Cl