Reaction Details
TargetDelta-type opioid receptor
LigandBDBM50000296
Substrate/Competitorn/a
Meas. Tech.ChEBML_217856
Ki 21000±n/a nM
Citation Rajagopalan, PScribner, RPennev, PSchmidt, WTam, SSteinfels, GCook, L DuP 747: a new, potent, kappa opioid analgesic. Synthesis and pharmacology1. Bioorg Med Chem Lett2:715-720 (1992)    Article
 
Delta-type opioid receptor
Name:Delta-type opioid receptor
Type:G Protein-Coupled Receptor (GPCR)
Mol. Mass.:40382.98
Organism:Homo sapiens (Human)
Description:Competition binding assays were carried out using membrane preparations from transfected HN9.10 cells that constitutively expressed the delta opioid receptor.
Residue:372
BDBM50000296
NameBDBM50000296
Synonyms:CHEMBL441765 U-50488H | US11492374, ID 1
TypeSmall organic molecule
Emp. Form.C19H26Cl2N2O
Mol. Mass.369.329
SMILESCN([C@@H]1CCCC[C@H]1N1CCCC1)C(=O)Cc1ccc(Cl)c(Cl)c1