Reaction Details
TargetMu-type opioid receptor
LigandBDBM50000296
Substrate/Competitorn/a
Meas. Tech.ChEBML_222066
Ki 825±n/a nM
Citation Rajagopalan, PScribner, RPennev, PSchmidt, WTam, SSteinfels, GCook, L DuP 747: a new, potent, kappa opioid analgesic. Synthesis and pharmacology1. Bioorg Med Chem Lett2:715-720 (1992)    Article
 
Mu-type opioid receptor
Name:Mu-type opioid receptor
Type:G Protein-Coupled Receptor (GPCR)
Mol. Mass.:44789.51
Organism:Homo sapiens (Human)
Description:P35372
Residue:400
BDBM50000296
NameBDBM50000296
Synonyms:CHEMBL441765 U-50488H | US11492374, ID 1
TypeSmall organic molecule
Emp. Form.C19H26Cl2N2O
Mol. Mass.369.329
SMILESCN([C@@H]1CCCC[C@H]1N1CCCC1)C(=O)Cc1ccc(Cl)c(Cl)c1