Reaction Details
TargetLeukotriene B4 receptor 1
LigandBDBM50280885
Substrate/Competitorn/a
Meas. Tech.ChEBML_98512
Ki 751±n/a nM
Citation Scott Sawyer, JBaldwin, RFFroelich, LLSaussy, DLJackson, WT Synthesis and pharmacologic activity of hydroxyacetophenone-substituted benzophenone/xanthone leukotriene B4 receptor antagonists Bioorg Med Chem Lett3:1981-1984 (1993)    Article
 
Leukotriene B4 receptor 1
Name:Leukotriene B4 receptor 1
Type:Enzyme Catalytic Domain
Mol. Mass.:37582.68
Organism:Homo sapiens (Human)
Description:Q15722
Residue:352
BDBM50280885
NameBDBM50280885
Synonyms:CHEMBL58534 | disodium 6-[3-(4-acetyl-2-ethyl-5-olatophenoxy)propoxy]-9-oxo-9H-2-xanthenecarboxylate
TypeSmall organic molecule
Emp. Form.C27H22O8
Mol. Mass.474.4599
SMILESCCc1cc(C(C)=O)c([O-])cc1OCCCOc1ccc2c(c1)oc1ccc(cc1c2=O)C([O-])=O