Reaction Details
TargetNeurotensin receptor type 1
LigandBDBM50366296
Substrate/Competitorn/a
Meas. Tech.ChEBML_144304
Ki 180±n/a nM
Citation Cain, GAChristos, TEJohnson, ALPottorf, RSConfalone, PNWilliam Tam, SSchmidt, WK Neurotensin receptor binding and antinociceptive activity for lipophilic N-amido neurotensin(913) analogs Bioorg Med Chem Lett3:2055-2060 (1993)    Article
 
Neurotensin receptor type 1
Name:Neurotensin receptor type 1
Type:PROTEIN
Mol. Mass.:47070.64
Organism:Rattus norvegicus
Description:ChEMBL_1466612
Residue:424
BDBM50366296
NameBDBM50366296
Synonyms:CHEMBL1790463
TypeSmall organic molecule
Emp. Form.C42H64N6O8
Mol. Mass.780.993
SMILESCC[C@@H](C)[C@H](NC(=O)[C@H](Cc1ccc(O)cc1)NC(=O)[C@@H]1CCCN1C(=O)[C@H](CCCN)NC(=O)C12CC3CC(CC(C3)C1)C2)C(=O)N[C@@H](CC(C)C)C(O)=O