Reaction Details
TargetPhospholipase A2
LigandBDBM50015214
Substrate/Competitorn/a
Meas. Tech.ChEBML_156506
IC50 100000±n/a nM
Citation Wilkerson, WDeLucca, IGalbraith, WHarris, RKerr, J Antiinflammatory -benzeneethanamines. III Bioorg Med Chem Lett3:711-716 (1993)    Article
 
Phospholipase A2
Name:Phospholipase A2
Type:PROTEIN
Mol. Mass.:16427.59
Organism:Rattus norvegicus
Description:ChEMBL_156506
Residue:146
BDBM50015214
NameBDBM50015214
Synonyms:6-chloro-2-methoxy-9-acridinyl(4-diethylamino-1-methylbutyl)amine CHEMBL7568 N*4*-(6-Chloro-2-methoxy-acridin-9-yl)-N*1*,N*1*-diethyl-pentane-1,4-diamine N*4*-(6-Chloro-2-methoxy-acridin-9-yl)-N*1*,N*1*-diethyl-pentane-1,4-diamine ; (mepacrine) cid_237 | quinacrine
TypeSmall organic molecule
Emp. Form.C23H30ClN3O
Mol. Mass.399.957
SMILESCCN(CC)CCCC(C)Nc1c2ccc(Cl)cc2nc2ccc(OC)cc12