Reaction Details
TargetGag-Pol polyprotein [489-587]
LigandBDBM50281646
Substrate/Competitorn/a
Meas. Tech.ChEBML_157566
Ki 61±n/a nM
Citation Sawyer, TFisher, JHester, JSmith, CTomasselli, ATarpley, WBurton, PHui, JMcQuade, TConradi, RBradford, VLiu, LKinner, JTustin, JAlexander, DHarrison, AEmmert, DStaples, DMaggiora, LZhang, YPoorman, RDunna, BRao, CScarborough, PLowther, WCraik, CDeCamp, DMoon, JHowe, WHeinrikson, R Peptidomimetic inhibitors of human immunodeficiency virus protease (HIV-PR): Design, enzyme binding and selectivity, antiviral efficacy, and cell permeability properties Bioorg Med Chem Lett3:819-824 (1993)    Article
 
Gag-Pol polyprotein [489-587]
Name:Gag-Pol polyprotein [489-587]
Type:Enzyme Subunit
Mol. Mass.:10781.16
Organism:Human immunodeficiency virus type 1
Description:P04585[489-587]
Residue:99
BDBM50281646
NameBDBM50281646
Synonyms:(2S,4S,5S)-6-Cyclohexyl-4-hydroxy-2-isopropyl-5-(2-phenoxy-acetylamino)-hexanoic acid {(S)-2-methyl-1-[(pyridin-2-ylmethyl)-carbamoyl]-butyl}-amide | CHEMBL168651
TypeSmall organic molecule
Emp. Form.C35H52N4O5
Mol. Mass.608.8112
SMILESCCC(C)[C@H](NC(=O)[C@@H](C[C@H](O)[C@H](CC1CCCCC1)NC(=O)COc1ccccc1)C(C)C)C(=O)NCc1ccccn1