Reaction Details
TargetGastrin/cholecystokinin type B receptor
LigandBDBM50024321
Substrate/Competitorn/a
Meas. Tech.ChEBML_48105
Ki 22±n/a nM
Citation Hill, DHorwell, DHunter, JKneen, CPritchard, MSuman-Chauhan, N Synthesis of a potent and selective non-peptide CCK-B/gastrin receptor antagonist tritiated ligand. Bioorg Med Chem Lett3:885-888 (1993)    Article
 
Gastrin/cholecystokinin type B receptor
Name:Gastrin/cholecystokinin type B receptor
Type:G Protein-Coupled Receptor (GPCR)
Mol. Mass.:48445.79
Organism:Homo sapiens (Human)
Description:Stable expression of human CCK-2 receptors in HEK 293 cells.
Residue:447
BDBM50024321
NameBDBM50024321
Synonyms:3-{2-[2-(3-tert-Butoxycarbonylamino-propionylamino)-3-(1H-indol-3-yl)-propionylamino]-4-methylsulfanyl-butyrylamino}-N-(1-carbamoyl-2-phenyl-ethyl)-succinamic acid CHEMBL1328 PENTAGASTRIN | Peptavlon
TypeSmall organic molecule
Emp. Form.C37H49N7O9S
Mol. Mass.767.891
SMILESCSCC[C@H](NC(=O)[C@H](Cc1c[nH]c2ccccc12)NC(=O)CCNC(=O)OC(C)(C)C)C(=O)N[C@@H](CC(O)=O)C(=O)N[C@@H](Cc1ccccc1)C(N)=O