Reaction Details
TargetSodium-dependent dopamine transporter
LigandBDBM50035738
Substrate/Competitorn/a
Meas. Tech.ChEMBL_62806 (CHEMBL674119)
IC50 1.7±n/a nM
Citation Kozikowski, APRoberti, MJohnson, KMBergmann, JSBall, RG SAR of cocaine: further exploration of structural variations at the C-2 center provides compounds of subnanomolar binding potency Bioorg Med Chem Lett3:1327-1332 (1993)    Article
 
Sodium-dependent dopamine transporter
Name:Sodium-dependent dopamine transporter
Type:Multi-pass membrane protein
Mol. Mass.:68497.11
Organism:Homo sapiens (Human)
Description:Q01959
Residue:620
BDBM50035738
NameBDBM50035738
Synonyms:(R)-3-(4-Chloro-phenyl)-8-methyl-8-aza-bicyclo[3.2.1]octane-2-carboxylic acid methyl ester 3-(4-Fluoro-phenyl)-8-methyl-8-aza-bicyclo[3.2.1]octane-2-carboxylic acid methyl ester | CHEMBL306208
TypeSmall organic molecule
Emp. Form.C16H20ClNO2
Mol. Mass.293.789
SMILESCOC(=O)C1C2CCC(CC1c1ccc(Cl)cc1)N2C