Reaction Details
TargetPlatelet-activating factor receptor
LigandBDBM81972
Substrate/Competitorn/a
Meas. Tech.ChEBML_155136
IC50 13±n/a nM
Citation Whittaker, MThompson, TMSpavold, ZMPrice, MMiller, AGalloway, WFraser, FFloyd, CDDrummond, AHDavidson, AHBowles, SABebbington, DS Cyclic ether acetal platelet activating factor (PAF) receptor antagonists I: 3-pyridyl derivatives Bioorg Med Chem Lett3:1493-1498 (1993)    Article
 
Platelet-activating factor receptor
Name:Platelet-activating factor receptor
Type:Enzyme Catalytic Domain
Mol. Mass.:39219.60
Organism:Homo sapiens (Human)
Description:PAF Platelet activating factor PTAFR HUMAN::P25105
Residue:342
BDBM81972
NameBDBM81972
Synonyms:(S)-(+)-ALPHA-METHYL-1H-IMIDAZOLE-4-ETHANAMINE DIHYDROBROMIDE CAS_75614-93-6
TypeSmall organic molecule
Emp. Form.C6H11N3
Mol. Mass.125.1716
SMILESC[C@H](N)Cc1cnc[nH]1