Reaction Details
TargetInositol 1,4,5-trisphosphate receptor type 3
LigandBDBM50132166
Substrate/Competitorn/a
Meas. Tech.ChEBML_90104
Ki 26.4±n/a nM
Citation Mills, SJSafrany, STWilcox, RANahorski, SRPotter, BV Synthesis of myo-inositol 1,2,4,5-tetrakisphosphate, a Ca2+-mobilising tetrakisphosphate with a potency similar to myo-inositol 1,4,5-trisphosphate Bioorg Med Chem Lett3:1505-1510 (1993)    Article
 
Inositol 1,4,5-trisphosphate receptor type 3
Name:Inositol 1,4,5-trisphosphate receptor type 3
Type:PROTEIN
Mol. Mass.:303035.22
Organism:Bos taurus
Description:ChEMBL_90104
Residue:2664
BDBM50132166
NameBDBM50132166
Synonyms:1,2,4,5-InsP4 Phosphoric acid mono-(2,5-dihydroxy-3,4,6-tris-phosphonooxy-cyclohexyl) ester | Tetraphosphoric acid-(2,5-dihydroxy-3,4,6-tris-phosphonooxy-cyclohexyl) ester
TypeSmall organic molecule
Emp. Form.C6H16O18P4
Mol. Mass.500.0755
SMILESOC1C(OP(O)(O)=O)C(OP(O)(O)=O)C(O)C(OP(O)(O)=O)C1OP(O)(O)=O