Reaction Details
TargetType-1 angiotensin II receptor B
LigandBDBM50449909
Substrate/Competitorn/a
Meas. Tech.ChEMBL_34833 (CHEMBL648767)
Ki 13±n/a nM
Citation Poss, MAGu, ZRyono, DEReid, JASieber-McMaster, ESpitzmiller, ERDejneka, TDickinson, KEWilliams, SBMoreland, SDelaney, CLBird, JWaldron, TLSchaeffer, TRHedberg, SPetrillo, EW 1,4-substituted indoles: a potent and selective class of angiostensin II receptor antagonists Bioorg Med Chem Lett4:145-150 (1994)    Article
 
Type-1 angiotensin II receptor B
Name:Type-1 angiotensin II receptor B
Type:Enzyme Catalytic Domain
Mol. Mass.:40929.44
Organism:RAT
Description:Angiotensin II AT1B 0 RAT::P29089
Residue:359
BDBM50449909
NameBDBM50449909
Synonyms:CHEMBL2079769
TypeSmall organic molecule
Emp. Form.C32H35ClKN7O4
Mol. Mass.656.216
SMILES[K+].CCCCc1nc(Cl)c(C(=O)OC(OC(=O)C(C)C)C(C)C)n1Cc1cccc2n(ccc12)-c1ccccc1-c1nn[n-]n1