Reaction Details
TargetType-1 angiotensin II receptor B
LigandBDBM50282244
Substrate/Competitorn/a
Meas. Tech.ChEMBL_34833 (CHEMBL648767)
Ki 3600±n/a nM
Citation Poss, MAGu, ZRyono, DEReid, JASieber-McMaster, ESpitzmiller, ERDejneka, TDickinson, KEWilliams, SBMoreland, SDelaney, CLBird, JWaldron, TLSchaeffer, TRHedberg, SPetrillo, EW 1,4-substituted indoles: a potent and selective class of angiostensin II receptor antagonists Bioorg Med Chem Lett4:145-150 (1994)    Article
 
Type-1 angiotensin II receptor B
Name:Type-1 angiotensin II receptor B
Type:Enzyme Catalytic Domain
Mol. Mass.:40929.44
Organism:RAT
Description:Angiotensin II AT1B 0 RAT::P29089
Residue:359
BDBM50282244
NameBDBM50282244
Synonyms:2-Butyl-3-{1-[2-(2H-tetrazol-5-yl)-phenyl]-1H-indol-4-ylmethyl}-3H-imidazole-4-carboxylic acid | CHEMBL433230
TypeSmall organic molecule
Emp. Form.C24H23N7O2
Mol. Mass.441.4851
SMILESCCCCc1ncc(C(O)=O)n1Cc1cccc2n(ccc12)-c1ccccc1-c1nnn[nH]1