Reaction Details
TargetAngiotensin-converting enzyme
LigandBDBM50282845
Substrate/Competitorn/a
Meas. Tech.ChEBML_34792
IC50 7.8±n/a nM
Citation Delaney, NGBarrish, JCNeubeck, RNatarajan, SCohen, MRovnyak, GCHuber, GMurugesan, NGirotra, RSieber-McMaster, ERobl, JAAsaad, MMCheung, HSBird, JWaldron, TPetrillo, EW Mercaptoacyl dipeptides as dual inhibitors of angiotensin-converting enzyme and neutral endopeptidase. Preliminary structure-activity studies Bioorg Med Chem Lett4:1783-1788 (1994)    Article
 
Angiotensin-converting enzyme
Name:Angiotensin-converting enzyme
Type:n/a
Mol. Mass.:150405.15
Organism:Oryctolagus cuniculus
Description:n/a
Residue:1310
BDBM50282845
NameBDBM50282845
Synonyms:(S)-1-[(S)-2-((S)-2-Mercaptomethyl-3-phenyl-propionylamino)-propionyl]-2,3-dihydro-1H-indole-2-carboxylic acid | CHEMBL50582
TypeSmall organic molecule
Emp. Form.C22H24N2O4S
Mol. Mass.412.502
SMILESC[C@H](NC(=O)[C@@H](CS)Cc1ccccc1)C(=O)N1[C@@H](Cc2ccccc12)C(O)=O