Reaction Details
TargetNeprilysin
LigandBDBM50282852
Substrate/Competitorn/a
Meas. Tech.ChEBML_144599
IC50 6.2±n/a nM
Citation Delaney, NGBarrish, JCNeubeck, RNatarajan, SCohen, MRovnyak, GCHuber, GMurugesan, NGirotra, RSieber-McMaster, ERobl, JAAsaad, MMCheung, HSBird, JWaldron, TPetrillo, EW Mercaptoacyl dipeptides as dual inhibitors of angiotensin-converting enzyme and neutral endopeptidase. Preliminary structure-activity studies Bioorg Med Chem Lett4:1783-1788 (1994)    Article
 
Neprilysin
Name:Neprilysin
Type:Protein
Mol. Mass.:85789.59
Organism:Rattus norvegicus (Rat)
Description:P07861
Residue:750
BDBM50282852
NameBDBM50282852
Synonyms:1-[2-((S)-2-Mercaptomethyl-3-o-tolyl-propionylamino)-propionyl]-pyrrolidine-2-carboxylic acid | CHEMBL50914
TypeSmall organic molecule
Emp. Form.C19H26N2O4S
Mol. Mass.378.486
SMILESC[C@H](NC(=O)[C@@H](CS)Cc1ccccc1C)C(=O)N1CCC[C@@H]1C(O)=O