Reaction Details
TargetNeprilysin
LigandBDBM50282858
Substrate/Competitorn/a
Meas. Tech.ChEBML_144599
IC50 9.4±n/a nM
Citation Delaney, NGBarrish, JCNeubeck, RNatarajan, SCohen, MRovnyak, GCHuber, GMurugesan, NGirotra, RSieber-McMaster, ERobl, JAAsaad, MMCheung, HSBird, JWaldron, TPetrillo, EW Mercaptoacyl dipeptides as dual inhibitors of angiotensin-converting enzyme and neutral endopeptidase. Preliminary structure-activity studies Bioorg Med Chem Lett4:1783-1788 (1994)    Article
 
Neprilysin
Name:Neprilysin
Type:Protein
Mol. Mass.:85789.59
Organism:Rattus norvegicus (Rat)
Description:P07861
Residue:750
BDBM50282858
NameBDBM50282858
Synonyms:3-((S)-2-Mercaptomethyl-3-phenyl-propionylamino)-propionic acid | CHEMBL51466
TypeSmall organic molecule
Emp. Form.C13H17NO3S
Mol. Mass.267.344
SMILESOC(=O)CCNC(=O)[C@@H](CS)Cc1ccccc1